PDA

View Full Version : Error 28 -6103: Could not find file



Ilkkaa
11-21-2012, 05:19 AM
Dear People,

I have an InstallShield project which is integrated with Visual Studio 2010. It has been working perfectly until yesterday. Now I cannot build the installation project anymore. Some files are missing..? Please see the error messages:

Building MsiFileHash table
ISEXP : error : -6271: File C:\Windows\assembly\NativeImages_v4.0.30319_32\Microsoft.CSharp\4bacbc23cd4c0841cf4c18399b30b63c\Microsoft.CSharp.ni.dll not found. An error occurred building the MsiFileHash table record for this file. Verify that the file exists in the specified location.
ISEXP : error : -6271: File C:\Windows\assembly\NativeImages_v4.0.30319_32\System.Dynamic\559594e862b578f3040446d7d4498cb7\System.Dynamic.ni.dll not found. An error occurred building the MsiFileHash table record for this file. Verify that the file exists in the specified location.
ISEXP : error : -6271: File C:\Windows\assembly\NativeImages_v4.0.30319_32\System.Numerics\360e9c00572679f437fff0ae719a5886\System.Numerics.ni.dll not found. An error occurred building the MsiFileHash table record for this file. Verify that the file exists in the specified location.
MsiFileHash table successfully built


I have not made any changes to the InstallShield project.. Just worked with the C# source code and builded new executables. I made also a Windows update on Monday.. Can it be the reason..?

What do you think?

Best regards,
Ilkka